Reaction Details
TargetSphingosine 1-phosphate receptor 3
LigandBDBM50248364
Substrate/Competitorn/a
Meas. Tech.ChEMBL_1679176 (CHEMBL4029453)
IC50 100±n/a nM
Citation Dyckman, AJ Modulators of Sphingosine-1-phosphate Pathway Biology: Recent Advances of Sphingosine-1-phosphate Receptor 1 (S1P J Med Chem60:5267-5289 (2017) 
 
Sphingosine 1-phosphate receptor 3
Name:Sphingosine 1-phosphate receptor 3
Type:G Protein-Coupled Receptor (GPCR)
Mol. Mass.:42278.13
Organism:Homo sapiens (Human)
Description:Q99500
Residue:378
BDBM50248364
NameBDBM50248364
Synonyms:CHEMBL4077381
TypeSmall organic molecule
Emp. Form.C19H34NO2P
Mol. Mass.339.4525
SMILESCCCCCCCCc1ccc(CNCCCP(C)(O)=O)cc1