Reaction Details
TargetSphingosine 1-phosphate receptor 1
LigandBDBM139203
Substrate/Competitorn/a
Meas. Tech.ChEMBL_1679188 (CHEMBL4029465)
EC50 6.0±n/a nM
Citation Dyckman, AJ Modulators of Sphingosine-1-phosphate Pathway Biology: Recent Advances of Sphingosine-1-phosphate Receptor 1 (S1P J Med Chem60:5267-5289 (2017) 
 
Sphingosine 1-phosphate receptor 1
Name:Sphingosine 1-phosphate receptor 1
Type:Enzyme
Mol. Mass.:42836.02
Organism:Homo sapiens (Human)
Description:P21453
Residue:382
BDBM139203
NameBDBM139203
Synonyms:US8889668, I33
TypeSmall organic molecule
Emp. Form.C23H19FN2O2
Mol. Mass.374.4076
SMILESCOc1ccc(F)cc1-c1noc(n1)-c1ccc(c(C)c1)-c1ccccc1C