Reaction Details
TargetSphingosine 1-phosphate receptor 3
LigandBDBM50248368
Substrate/Competitorn/a
Meas. Tech.ChEMBL_1679182 (CHEMBL4029459)
Ki 2200±n/a nM
Citation Dyckman, AJ Modulators of Sphingosine-1-phosphate Pathway Biology: Recent Advances of Sphingosine-1-phosphate Receptor 1 (S1P J Med Chem60:5267-5289 (2017) 
 
Sphingosine 1-phosphate receptor 3
Name:Sphingosine 1-phosphate receptor 3
Type:G Protein-Coupled Receptor (GPCR)
Mol. Mass.:42278.13
Organism:Homo sapiens (Human)
Description:Q99500
Residue:378
BDBM50248368
NameBDBM50248368
Synonyms:CHEMBL4085783
TypeSmall organic molecule
Emp. Form.C30H23FN2O4
Mol. Mass.494.513
SMILESCOCc1cc(ccc1-c1ccccc1C)-c1nc(no1)-c1ccc(cc1)-c1ccc(C(O)=O)c(F)c1