Reaction Details
TargetSerine/threonine-protein kinase pim-1
LigandBDBM50387298
Substrate/Competitorn/a
Meas. Tech.ChEMBL_1679428 (CHEMBL4029705)
IC50 0.400000±n/a nM
Citation Bataille, CJBrennan, MBByrne, SDavies, SGDurbin, MFedorov, OHuber, KVJones, AMKnapp, SLiu, GNadali, AQuevedo, CERussell, AJWalker, RGWestwood, RWynne, GM Thiazolidine derivatives as potent and selective inhibitors of the PIM kinase family. Bioorg Med Chem25:2657-2665 (2017) 
 
Serine/threonine-protein kinase pim-1
Name:Serine/threonine-protein kinase pim-1
Type:Protein
Mol. Mass.:35681.82
Organism:Homo sapiens (Human)
Description:P11309
Residue:313
BDBM50387298
NameBDBM50387298
Synonyms:CHEMBL2048872
TypeSmall organic molecule
Emp. Form.C21H21N3O2S
Mol. Mass.379.475
SMILESN[C@@H]1CCCN(C1)c1c(C=C2SC(O)=NC2=O)cccc1-c1ccccc1