Reaction Details
TargetSerine/threonine-protein kinase pim-1
LigandBDBM50248876
Substrate/Competitorn/a
Meas. Tech.ChEMBL_1679402 (CHEMBL4029679)
IC50 107±n/a nM
Citation Bataille, CJBrennan, MBByrne, SDavies, SGDurbin, MFedorov, OHuber, KVJones, AMKnapp, SLiu, GNadali, AQuevedo, CERussell, AJWalker, RGWestwood, RWynne, GM Thiazolidine derivatives as potent and selective inhibitors of the PIM kinase family. Bioorg Med Chem25:2657-2665 (2017) 
 
Serine/threonine-protein kinase pim-1
Name:Serine/threonine-protein kinase pim-1
Type:Protein
Mol. Mass.:35681.82
Organism:Homo sapiens (Human)
Description:P11309
Residue:313
BDBM50248876
NameBDBM50248876
Synonyms:CHEMBL4100024
TypeSmall organic molecule
Emp. Form.C15H8N2O3S
Mol. Mass.296.301
SMILESO=C1NC(=S)n2c1cc1ccc(cc1c2=O)-c1ccco1