Reaction Details
TargetSerine/threonine-protein kinase pim-1
LigandBDBM50248894
Substrate/Competitorn/a
Meas. Tech.ChEMBL_1679402 (CHEMBL4029679)
IC50 7.0±n/a nM
Citation Bataille, CJBrennan, MBByrne, SDavies, SGDurbin, MFedorov, OHuber, KVJones, AMKnapp, SLiu, GNadali, AQuevedo, CERussell, AJWalker, RGWestwood, RWynne, GM Thiazolidine derivatives as potent and selective inhibitors of the PIM kinase family. Bioorg Med Chem25:2657-2665 (2017) 
 
Serine/threonine-protein kinase pim-1
Name:Serine/threonine-protein kinase pim-1
Type:Protein
Mol. Mass.:35681.82
Organism:Homo sapiens (Human)
Description:P11309
Residue:313
BDBM50248894
NameBDBM50248894
Synonyms:CHEMBL4060062
TypeSmall organic molecule
Emp. Form.C18H17N3OS3
Mol. Mass.387.542
SMILESO=C1NC(=S)S\C1=C/c1csc(n1)-c1cccc(c1)N1CCCCC1