Reaction Details
TargetSerine/threonine-protein kinase pim-1
LigandBDBM50248916
Substrate/Competitorn/a
Meas. Tech.ChEMBL_1679402 (CHEMBL4029679)
IC50 458±n/a nM
Citation Bataille, CJBrennan, MBByrne, SDavies, SGDurbin, MFedorov, OHuber, KVJones, AMKnapp, SLiu, GNadali, AQuevedo, CERussell, AJWalker, RGWestwood, RWynne, GM Thiazolidine derivatives as potent and selective inhibitors of the PIM kinase family. Bioorg Med Chem25:2657-2665 (2017) 
 
Serine/threonine-protein kinase pim-1
Name:Serine/threonine-protein kinase pim-1
Type:Protein
Mol. Mass.:35681.82
Organism:Homo sapiens (Human)
Description:P11309
Residue:313
BDBM50248916
NameBDBM50248916
Synonyms:CHEMBL1957779
TypeSmall organic molecule
Emp. Form.C8H5NOS3
Mol. Mass.227.326
SMILESO=C1NC(=S)S\C1=C/c1cccs1