Reaction Details
TargetNitric oxide synthase, brain
LigandBDBM190667
Substrate/Competitorn/a
Meas. Tech.ChEBML_1681886
Ki 16±n/a nM
Citation Do, HTWang, HYLi, HChreifi, GPoulos, TLSilverman, RB Improvement of Cell Permeability of Human Neuronal Nitric Oxide Synthase Inhibitors Using Potent and Selective 2-Aminopyridine-Based Scaffolds with a Fluorobenzene Linker. J Med Chem60:9360-9375 (2017) 
 
Nitric oxide synthase, brain
Name:Nitric oxide synthase, brain
Type:Enzyme
Mol. Mass.:160570.98
Organism:Rattus norvegicus (rat)
Description:Recombinant nNOS overexpressed in E. coli was used in enzyme assays.
Residue:1429
BDBM190667
NameBDBM190667
Synonyms:US10759791, Compound 14j | nNOS inhibitor, 5
TypeSmall organic molecule
Emp. Form.C17H24N4
Mol. Mass.284.3993
SMILESCNCCCc1cncc(CCc2cc(C)cc(N)n2)c1