Reaction Details
TargetTyrosine-protein kinase JAK3
LigandBDBM50250928
Substrate/Competitorn/a
Meas. Tech.ChEBML_1682727
IC50 701±n/a nM
Citation Siu, TBrubaker, JFuller, PTorres, LZeng, HClose, JMampreian, DMShi, FLiu, DFradera, XJohnson, KBays, NKadic, EHe, FGoldenblatt, PShaffer, LPatel, SBLesburg, CAAlpert, CDorosh, LDeshmukh, SVYu, HKlappenbach, JElwood, FDinsmore, CJFernandez, RMoy, LYoung, JR The Discovery of 3-((4-Chloro-3-methoxyphenyl)amino)-1-((3R,4S)-4-cyanotetrahydro-2H-pyran-3-yl)-1H-pyrazole-4-carboxamide, a Highly Ligand Efficient and Efficacious Janus Kinase 1 Selective Inhibitor with Favorable Pharmacokinetic Properties. J Med Chem60:9676-9690 (2017) 
 
Tyrosine-protein kinase JAK3
Name:Tyrosine-protein kinase JAK3
Type:Protein
Mol. Mass.:125111.08
Organism:Homo sapiens (Human)
Description:P52333
Residue:1124
BDBM50250928
NameBDBM50250928
Synonyms:CHEMBL4092626
TypeSmall organic molecule
Emp. Form.C17H20FN7O2
Mol. Mass.373.3848
SMILESCN(C)c1cc(Nc2nn(cc2C(N)=O)[C@H]2COCC[C@@H]2C#N)cc(F)n1