Reaction Details
TargetNon-receptor tyrosine-protein kinase TYK2
LigandBDBM237866
Substrate/Competitorn/a
Meas. Tech.ChEBML_1682728
IC50 3.0±n/a nM
Citation Siu, TBrubaker, JFuller, PTorres, LZeng, HClose, JMampreian, DMShi, FLiu, DFradera, XJohnson, KBays, NKadic, EHe, FGoldenblatt, PShaffer, LPatel, SBLesburg, CAAlpert, CDorosh, LDeshmukh, SVYu, HKlappenbach, JElwood, FDinsmore, CJFernandez, RMoy, LYoung, JR The Discovery of 3-((4-Chloro-3-methoxyphenyl)amino)-1-((3R,4S)-4-cyanotetrahydro-2H-pyran-3-yl)-1H-pyrazole-4-carboxamide, a Highly Ligand Efficient and Efficacious Janus Kinase 1 Selective Inhibitor with Favorable Pharmacokinetic Properties. J Med Chem60:9676-9690 (2017) 
 
Non-receptor tyrosine-protein kinase TYK2
Name:Non-receptor tyrosine-protein kinase TYK2
Type:Protein
Mol. Mass.:133666.03
Organism:Homo sapiens (Human)
Description:P29597
Residue:1187
BDBM237866
NameBDBM237866
Synonyms:US9394282, 9-1
TypeSmall organic molecule
Emp. Form.C15H15FN6O2
Mol. Mass.330.317
SMILESNC(=O)c1cn(nc1Nc1ccnc(F)c1)[C@H]1COCC[C@@H]1C#N