Reaction Details
TargetNon-receptor tyrosine-protein kinase TYK2
LigandBDBM50250928
Substrate/Competitorn/a
Meas. Tech.ChEBML_1682728
IC50 13±n/a nM
Citation Siu, TBrubaker, JFuller, PTorres, LZeng, HClose, JMampreian, DMShi, FLiu, DFradera, XJohnson, KBays, NKadic, EHe, FGoldenblatt, PShaffer, LPatel, SBLesburg, CAAlpert, CDorosh, LDeshmukh, SVYu, HKlappenbach, JElwood, FDinsmore, CJFernandez, RMoy, LYoung, JR The Discovery of 3-((4-Chloro-3-methoxyphenyl)amino)-1-((3R,4S)-4-cyanotetrahydro-2H-pyran-3-yl)-1H-pyrazole-4-carboxamide, a Highly Ligand Efficient and Efficacious Janus Kinase 1 Selective Inhibitor with Favorable Pharmacokinetic Properties. J Med Chem60:9676-9690 (2017) 
 
Non-receptor tyrosine-protein kinase TYK2
Name:Non-receptor tyrosine-protein kinase TYK2
Type:Protein
Mol. Mass.:133666.03
Organism:Homo sapiens (Human)
Description:P29597
Residue:1187
BDBM50250928
NameBDBM50250928
Synonyms:CHEMBL4092626
TypeSmall organic molecule
Emp. Form.C17H20FN7O2
Mol. Mass.373.3848
SMILESCN(C)c1cc(Nc2nn(cc2C(N)=O)[C@H]2COCC[C@@H]2C#N)cc(F)n1