Reaction Details
TargetPotassium voltage-gated channel subfamily H member 2
LigandBDBM237866
Substrate/Competitorn/a
Meas. Tech.ChEMBL_1682731 (CHEMBL4033008)
IC50>60000±n/a nM
Citation Siu, TBrubaker, JFuller, PTorres, LZeng, HClose, JMampreian, DMShi, FLiu, DFradera, XJohnson, KBays, NKadic, EHe, FGoldenblatt, PShaffer, LPatel, SBLesburg, CAAlpert, CDorosh, LDeshmukh, SVYu, HKlappenbach, JElwood, FDinsmore, CJFernandez, RMoy, LYoung, JR The Discovery of 3-((4-Chloro-3-methoxyphenyl)amino)-1-((3R,4S)-4-cyanotetrahydro-2H-pyran-3-yl)-1H-pyrazole-4-carboxamide, a Highly Ligand Efficient and Efficacious Janus Kinase 1 Selective Inhibitor with Favorable Pharmacokinetic Properties. J Med Chem60:9676-9690 (2017) 
 
Potassium voltage-gated channel subfamily H member 2
Name:Potassium voltage-gated channel subfamily H member 2
Type:Multi-pass membrane protein
Mol. Mass.:126672.65
Organism:Homo sapiens (Human)
Description:Q12809
Residue:1159
BDBM237866
NameBDBM237866
Synonyms:US9394282, 9-1
TypeSmall organic molecule
Emp. Form.C15H15FN6O2
Mol. Mass.330.317
SMILESNC(=O)c1cn(nc1Nc1ccnc(F)c1)[C@H]1COCC[C@@H]1C#N