Reaction Details
TargetTyrosine-protein kinase JAK1
LigandBDBM237866
Substrate/Competitorn/a
Meas. Tech.ChEMBL_1682729 (CHEMBL4033006)
IC50 42±n/a nM
Citation Siu, TBrubaker, JFuller, PTorres, LZeng, HClose, JMampreian, DMShi, FLiu, DFradera, XJohnson, KBays, NKadic, EHe, FGoldenblatt, PShaffer, LPatel, SBLesburg, CAAlpert, CDorosh, LDeshmukh, SVYu, HKlappenbach, JElwood, FDinsmore, CJFernandez, RMoy, LYoung, JR The Discovery of 3-((4-Chloro-3-methoxyphenyl)amino)-1-((3R,4S)-4-cyanotetrahydro-2H-pyran-3-yl)-1H-pyrazole-4-carboxamide, a Highly Ligand Efficient and Efficacious Janus Kinase 1 Selective Inhibitor with Favorable Pharmacokinetic Properties. J Med Chem60:9676-9690 (2017) 
 
Tyrosine-protein kinase JAK1
Name:Tyrosine-protein kinase JAK1
Type:Protein
Mol. Mass.:133293.73
Organism:Homo sapiens (Human)
Description:P23458
Residue:1154
BDBM237866
NameBDBM237866
Synonyms:US9394282, 9-1
TypeSmall organic molecule
Emp. Form.C15H15FN6O2
Mol. Mass.330.317
SMILESNC(=O)c1cn(nc1Nc1ccnc(F)c1)[C@H]1COCC[C@@H]1C#N