Reaction Details
TargetSigma non-opioid intracellular receptor 1
LigandBDBM50251222
Substrate/Competitorn/a
Meas. Tech.ChEBML_1683272
Ki 1.4±n/a nM
Citation Amata, ERescifina, APrezzavento, OArena, EDichiara, MPittalà, VMontilla-García, ÁPunzo, FMerino, PCobos, EJMarrazzo, A (+)-Methyl (1R,2S)-2-{[4-(4-Chlorophenyl)-4-hydroxypiperidin-1-yl]methyl}-1-phenylcyclopropanecarboxylate [(+)-MR200] Derivatives as Potent and Selective Sigma Receptor Ligands: Stereochemistry and Pharmacological Properties. J Med Chem61:372-384 (2018) 
 
Sigma non-opioid intracellular receptor 1
Name:Sigma non-opioid intracellular receptor 1
Type:Protein
Mol. Mass.:25307.17
Organism:Cavia porcellus (Guinea pig)
Description:Q60492
Residue:223
BDBM50251222
NameBDBM50251222
Synonyms:CHEMBL4076606
TypeSmall organic molecule
Emp. Form.C24H28ClNO3
Mol. Mass.413.937
SMILESCCOC(=O)[C@@]1(C[C@@H]1CN1CCC(O)(CC1)c1ccc(Cl)cc1)c1ccccc1