Reaction Details
TargetDual specificity tyrosine-phosphorylation-regulated kinase 1A
LigandBDBM50251509
Substrate/Competitorn/a
Meas. Tech.ChEBML_1683762
IC50 8.0±n/a nM
Citation Shaw, SJGoff, DALin, NSingh, RLi, WMcLaughlin, JBaltgalvis, KAPayan, DGKinsella, TM Developing DYRK inhibitors derived from the meridianins as a means of increasing levels of NFAT in the nucleus. Bioorg Med Chem Lett27:2617-2621 (2017) 
 
Dual specificity tyrosine-phosphorylation-regulated kinase 1A
Name:Dual specificity tyrosine-phosphorylation-regulated kinase 1A
Type:Enzyme
Mol. Mass.:85616.61
Organism:Homo sapiens (Human)
Description:Q13627
Residue:763
BDBM50251509
NameBDBM50251509
Synonyms:CHEMBL4064316
TypeSmall organic molecule
Emp. Form.C15H15N3
Mol. Mass.237.2997
SMILESCC(C)n1cc(-c2ccncc2)c2ccncc12