Reaction Details
TargetDual specificity tyrosine-phosphorylation-regulated kinase 1A
LigandBDBM50251457
Substrate/Competitorn/a
Meas. Tech.ChEBML_1683762
IC50 8.0±n/a nM
Citation Shaw, SJGoff, DALin, NSingh, RLi, WMcLaughlin, JBaltgalvis, KAPayan, DGKinsella, TM Developing DYRK inhibitors derived from the meridianins as a means of increasing levels of NFAT in the nucleus. Bioorg Med Chem Lett27:2617-2621 (2017) 
 
Dual specificity tyrosine-phosphorylation-regulated kinase 1A
Name:Dual specificity tyrosine-phosphorylation-regulated kinase 1A
Type:Enzyme
Mol. Mass.:85616.61
Organism:Homo sapiens (Human)
Description:Q13627
Residue:763
BDBM50251457
NameBDBM50251457
Synonyms:CHEMBL4105629
TypeSmall organic molecule
Emp. Form.C17H17N3
Mol. Mass.263.337
SMILESC(Cn1cc(-c2ccncc2)c2ccncc12)C1CC1