Reaction Details
TargetMuscarinic acetylcholine receptor M3
LigandBDBM50453189
Substrate/Competitorn/a
Meas. Tech.ChEBML_138852
Ki 27700±n/a nM
Citation Carroll, FIAbraham, PChemburkar, SHe, XCMascarella, SWKwon, YWTriggle, DJ Synthesis and muscarinic receptor activity of ester derivatives of 2-substituted 2-azabicyclo[2.2.1]heptan-5-ol and -6-ol. J Med Chem35:2184-91 (1992) Muscarinic acetylcholine receptor M3
Name:Muscarinic acetylcholine receptor M3
Type:Enzyme Catalytic Domain
Mol. Mass.:66086.66
Organism:RAT
Description:Cholinergic, muscarinic M3 CHRM3 RAT::P08483
Residue:589
BDBM50453189
NameBDBM50453189
Synonyms:CHEMBL2114058
TypeSmall organic molecule
Emp. Form.C9H15NO2
Mol. Mass.169.2209
SMILESCN1CC2CC1C[C@H]2OC(C)=O