Reaction Details
TargetMuscarinic acetylcholine receptor M1
LigandBDBM50453187
Substrate/Competitorn/a
Meas. Tech.ChEBML_138935
Ki 2260±n/a nM
Citation Carroll, FIAbraham, PChemburkar, SHe, XCMascarella, SWKwon, YWTriggle, DJ Synthesis and muscarinic receptor activity of ester derivatives of 2-substituted 2-azabicyclo[2.2.1]heptan-5-ol and -6-ol. J Med Chem35:2184-91 (1992) Muscarinic acetylcholine receptor M1
Name:Muscarinic acetylcholine receptor M1
Type:Enzyme Catalytic Domain
Mol. Mass.:51390.46
Organism:RAT
Description:P08482
Residue:460
BDBM50453187
NameBDBM50453187
Synonyms:CHEMBL2115123
TypeSmall organic molecule
Emp. Form.C15H19NO2
Mol. Mass.245.3169
SMILESCC(=O)O[C@@H]1CC2CC1N(Cc1ccccc1)C2