Reaction Details
TargetMuscarinic acetylcholine receptor M1/M2/M3/M4/M5
LigandBDBM50006546
Substrate/Competitorn/a
Meas. Tech.ChEMBL_139316 (CHEMBL752309)
Ki 10300±n/a nM
Citation Carroll, FIAbraham, PChemburkar, SHe, XCMascarella, SWKwon, YWTriggle, DJ Synthesis and muscarinic receptor activity of ester derivatives of 2-substituted 2-azabicyclo[2.2.1]heptan-5-ol and -6-ol. J Med Chem35:2184-91 (1992) Muscarinic acetylcholine receptor M1/M2/M3/M4/M5
Name:Muscarinic acetylcholine receptor M1/M2/M3/M4/M5
Synonyms:Muscarinic acetylcholine receptor
Type:n/a
Mol. Mass.:n/a
Description:ASSAY_ID of ChEMBL is 1821274
Components:This complex has 5 components.
Component 1
Name:Muscarinic acetylcholine receptor M1
Type:Enzyme Catalytic Domain
Mol. Mass.:51390.46
Organism:RAT
Description:P08482
Residue:460
Component 2
Name:Muscarinic acetylcholine receptor M3
Synonyms:ACM3_RAT Chrm-3 | Chrm3
Type:Enzyme Catalytic Domain
Mol. Mass.:66086.66
Organism:RAT
Description:Cholinergic, muscarinic M3 CHRM3 RAT::P08483
Residue:589
Component 3
Name:Muscarinic acetylcholine receptor M4
Synonyms:ACM4_RAT Chrm-4 | Chrm4
Type:Enzyme Catalytic Domain
Mol. Mass.:52841.70
Organism:RAT
Description:Cholinergic, muscarinic M4 CHRM4 RAT::P08485
Residue:477
Component 4
Name:Muscarinic acetylcholine receptor M5
Synonyms:ACM5_RAT Chrm-5 Muscarinic acetylcholine receptor | Muscarinic acetylcholine receptor M5
Type:Enzyme Catalytic Domain
Mol. Mass.:60161.80
Organism:RAT
Description:Cholinergic, muscarinic M5 CHRM5 RAT::P08911
Residue:531
Component 5
Name:Muscarinic acetylcholine receptor M2
Synonyms:ACM2_RAT Chrm-2 | Chrm2
Type:Enzyme Catalytic Domain
Mol. Mass.:51555.53
Organism:RAT
Description:P10980
Residue:466
BDBM50006546
NameBDBM50006546
Synonyms:Acetic acid 2-benzyl-2-aza-bicyclo[2.2.1]hept-5-yl ester | CHEMBL67700
TypeSmall organic molecule
Emp. Form.C15H19NO2
Mol. Mass.245.3169
SMILESCC(=O)OC1CC2CC1CN2Cc1ccccc1