Reaction Details
TargetInduced myeloid leukemia cell differentiation protein Mcl-1
LigandBDBM50251669
Substrate/Competitorn/a
Meas. Tech.ChEMBL_1684253 (CHEMBL4034732)
Ki 262±n/a nM
Citation Zhao, BSensintaffar, JBian, ZBelmar, JLee, TOlejniczak, ETFesik, SW Structure of a Myeloid cell leukemia-1 (Mcl-1) inhibitor bound to drug site 3 of Human Serum Albumin. Bioorg Med Chem25:3087-3092 (2017) 
 
Induced myeloid leukemia cell differentiation protein Mcl-1
Name:Induced myeloid leukemia cell differentiation protein Mcl-1
Type:Membrane; Single-pass membrane protein
Mol. Mass.:37332.87
Organism:Homo sapiens (Human)
Description:Q07820
Residue:350
BDBM50251669
NameBDBM50251669
Synonyms:CHEMBL4073037
TypeSmall organic molecule
Emp. Form.C26H28ClN3O3
Mol. Mass.465.972
SMILESCc1nn(C)c(C)c1-c1cccc2c(CCCOc3cc(C)c(Cl)c(C)c3)c([nH]c12)C(O)=O