Reaction Details
TargetAdenosine receptor A2a/A2b
LigandBDBM50006696
Substrate/Competitorn/a
Meas. Tech.ChEMBL_27939 (CHEMBL649120)
Ki 6000±n/a nM
Citation Shimada, JSuzuki, FNonaka, HIshii, AIchikawa, S (E)-1,3-dialkyl-7-methyl-8-(3,4,5-trimethoxystyryl)xanthines: potent and selective adenosine A2 antagonists. J Med Chem35:2342-5 (1992) Adenosine receptor A2a/A2b
Name:Adenosine receptor A2a/A2b
Synonyms:Adenosine A2 receptor
Type:n/a
Mol. Mass.:n/a
Description:ASSAY_ID of ChEMBL is 30560
Components:This complex has 2 components.
Component 1
Name:Adenosine receptor A2b
Type:PROTEIN
Mol. Mass.:36378.84
Organism:Rattus norvegicus
Description:ChEMBL_32934
Residue:332
Component 2
Name:Adenosine receptor A2a
Synonyms:AA2AR_RAT Adenosine A2 receptor Adenosine Receptors A2a (A2a) Adenosine receptors A2a Rat striatal adenosine A2a receptor
Type:G Protein-Coupled Receptor (GPCR)
Mol. Mass.:45015.65
Organism:Rattus norvegicus (rat)
Description:Rat A2A receptors expressed in CHO cells.
Residue:410
BDBM50006696
NameBDBM50006696
Synonyms:8-(2-Cyclopentyl-ethyl)-1,3-dipropyl-3,7-dihydro-purine-2,6-dione | CHEMBL77435
TypeSmall organic molecule
Emp. Form.C18H28N4O2
Mol. Mass.332.4405
SMILESCCCn1c2nc(CCC3CCCC3)[nH]c2c(=O)n(CCC)c1=O