Reaction Details
TargetCytochrome P450 1B1
LigandBDBM23414
Substrate/Competitorn/a
Meas. Tech.ChEMBL_1684853 (CHEMBL4035332)
Ki 16±n/a nM
Citation Dutour, RPoirier, D Inhibitors of cytochrome P450 (CYP) 1B1. Eur J Med Chem135:296-306 (2017) 
 
Cytochrome P450 1B1
Name:Cytochrome P450 1B1
Type:PROTEIN
Mol. Mass.:60861.81
Organism:Homo sapiens (Human)
Description:ChEMBL_1474523
Residue:543
BDBM23414
NameBDBM23414
Synonyms:5,7-dihydroxy-2-(3-hydroxy-4-methoxyphenyl)-4H-chromen-4-one Diosmetin (25)
Typeflavone
Emp. Form.C16H12O6
Mol. Mass.300.2629
SMILESCOc1ccc(cc1O)-c1cc(=O)c2c(O)cc(O)cc2o1