Reaction Details
TargetC-C chemokine receptor type 5
LigandBDBM50252442
Substrate/Competitorn/a
Meas. Tech.ChEBML_1684933
EC50>10.0±n/a nM
Citation Thum, SKokornaczyk, AKSeki, TDe Maria, MOrtiz Zacarias, NVde Vries, HWeiss, CKoch, MSchepmann, DKitamura, MTschammer, NHeitman, LHJunker, AWünsch, B Synthesis and biological evaluation of chemokine receptor ligands with 2-benzazepine scaffold. Eur J Med Chem135:401-413 (2017) 
 
C-C chemokine receptor type 5
Name:C-C chemokine receptor type 5
Type:Enzyme
Mol. Mass.:40540.21
Organism:Homo sapiens (Human)
Description:P51681
Residue:352
BDBM50252442
NameBDBM50252442
Synonyms:CHEMBL4089329
TypeSmall organic molecule
Emp. Form.C29H38N4O5S
Mol. Mass.554.701
SMILESCC(C)CN1CC(=Cc2ccc(NS(C)(=O)=O)cc2C1=O)C(=O)Nc1ccc(CN(C)C2CCOCC2)cc1