Reaction Details
TargetSigma non-opioid intracellular receptor 1
LigandBDBM50006992
Substrate/Competitorn/a
Meas. Tech.ChEMBL_201262 (CHEMBL804880)
IC50 10±n/a nM
Citation Wilson, AADannals, RFRavert, HTSonders, MSWeber, EWagner, HN Radiosynthesis of sigma receptor ligands for positron emission tomography: 11C- and 18F-labeled guanidines. J Med Chem34:1867-70 (1991) Sigma non-opioid intracellular receptor 1
Name:Sigma non-opioid intracellular receptor 1
Type:Enzyme Catalytic Domain
Mol. Mass.:25124.85
Organism:Homo sapiens (Human)
Description:Q99720
Residue:223
BDBM50006992
NameBDBM50006992
Synonyms:CHEMBL292668 | N-Adamantan-1-yl-N'-(4-methoxy-phenyl)-guanidine
TypeSmall organic molecule
Emp. Form.C18H25N3O
Mol. Mass.299.4106
SMILESCOc1ccc(NC(N)=NC23CC4CC(CC(C4)C2)C3)cc1