Reaction Details
TargetCarbonic anhydrase 1
LigandBDBM50252992
Substrate/Competitorn/a
Meas. Tech.ChEMBL_1685227 (CHEMBL4035706)
IC50 0.140000±n/a nM
Citation Alt?ntop, MDSever, BÖzdemir, AKucukoglu, KOnem, HNadaroglu, HKaplanc?kl?, ZA Potential inhibitors of human carbonic anhydrase isozymes I and II: Design, synthesis and docking studies of new 1,3,4-thiadiazole derivatives. Bioorg Med Chem25:3547-3554 (2017) 
 
Carbonic anhydrase 1
Name:Carbonic anhydrase 1
Type:Enzyme
Mol. Mass.:28873.37
Organism:Homo sapiens (Human)
Description:P00915
Residue:261
BDBM50252992
NameBDBM50252992
Synonyms:CHEMBL4100496
TypeSmall organic molecule
Emp. Form.C21H16ClN5O2S2
Mol. Mass.469.967
SMILESClc1ccc(cc1)-c1ccc(\C=N\NC(=O)CSc2nnc(Nc3ccccc3)s2)o1