Reaction Details
TargetCarbonic anhydrase 1
LigandBDBM50252996
Substrate/Competitorn/a
Meas. Tech.ChEMBL_1685227 (CHEMBL4035706)
IC50 0.290000±n/a nM
Citation Alt?ntop, MDSever, BÖzdemir, AKucukoglu, KOnem, HNadaroglu, HKaplanc?kl?, ZA Potential inhibitors of human carbonic anhydrase isozymes I and II: Design, synthesis and docking studies of new 1,3,4-thiadiazole derivatives. Bioorg Med Chem25:3547-3554 (2017) 
 
Carbonic anhydrase 1
Name:Carbonic anhydrase 1
Type:Enzyme
Mol. Mass.:28873.37
Organism:Homo sapiens (Human)
Description:P00915
Residue:261
BDBM50252996
NameBDBM50252996
Synonyms:CHEMBL4097972
TypeSmall organic molecule
Emp. Form.C21H15Cl2N5O2S2
Mol. Mass.504.412
SMILESClc1ccc(-c2ccc(\C=N\NC(=O)CSc3nnc(Nc4ccccc4)s3)o2)c(Cl)c1