Reaction Details
TargetCarbonic anhydrase 2
LigandBDBM50252992
Substrate/Competitorn/a
Meas. Tech.ChEMBL_1685228 (CHEMBL4035707)
IC50 0.190000±n/a nM
Citation Alt?ntop, MDSever, BÖzdemir, AKucukoglu, KOnem, HNadaroglu, HKaplanc?kl?, ZA Potential inhibitors of human carbonic anhydrase isozymes I and II: Design, synthesis and docking studies of new 1,3,4-thiadiazole derivatives. Bioorg Med Chem25:3547-3554 (2017) 
 
Carbonic anhydrase 2
Name:Carbonic anhydrase 2
Type:Enzyme
Mol. Mass.:29250.71
Organism:Homo sapiens (Human)
Description:P00918
Residue:260
BDBM50252992
NameBDBM50252992
Synonyms:CHEMBL4100496
TypeSmall organic molecule
Emp. Form.C21H16ClN5O2S2
Mol. Mass.469.967
SMILESClc1ccc(cc1)-c1ccc(\C=N\NC(=O)CSc2nnc(Nc3ccccc3)s2)o1