Reaction Details
TargetCarbonic anhydrase 2
LigandBDBM50253004
Substrate/Competitorn/a
Meas. Tech.ChEBML_1685231
Ki 0.660000±n/a nM
Citation Alt?ntop, MDSever, BÖzdemir, AKucukoglu, KOnem, HNadaroglu, HKaplanc?kl?, ZA Potential inhibitors of human carbonic anhydrase isozymes I and II: Design, synthesis and docking studies of new 1,3,4-thiadiazole derivatives. Bioorg Med Chem25:3547-3554 (2017) 
 
Carbonic anhydrase 2
Name:Carbonic anhydrase 2
Type:Enzyme
Mol. Mass.:29250.71
Organism:Homo sapiens (Human)
Description:P00918
Residue:260
BDBM50253004
NameBDBM50253004
Synonyms:CHEMBL4072122
TypeSmall organic molecule
Emp. Form.C21H16N6O4S2
Mol. Mass.480.52
SMILES[O-][N+](=O)c1cccc(c1)-c1ccc(\C=N\NC(=O)CSc2nnc(Nc3ccccc3)s2)o1