Reaction Details
TargetKappa-type opioid receptor
LigandBDBM50253129
Substrate/Competitorn/a
Meas. Tech.ChEBML_1685446
Ki 1.2±n/a nM
Citation Hayashida, KHirayama, SIwai, TWatanabe, YTakahashi, TSakai, JNakata, EYamakawa, TFujii, HNagase, H Novel delta opioid receptor agonists with oxazatricyclodecane structure showing potent agonistic activities. Bioorg Med Chem Lett27:2742-2745 (2017) 
 
Kappa-type opioid receptor
Name:Kappa-type opioid receptor
Type:G Protein-Coupled Receptor (GPCR)
Mol. Mass.:42744.99
Organism:Cavia porcellus (domestic guinea pig)
Description:P41144
Residue:380
BDBM50253129
NameBDBM50253129
Synonyms:CHEMBL4066752
TypeSmall organic molecule
Emp. Form.C29H32N2O3
Mol. Mass.456.576
SMILES[H][C@]12CN(C3CCC4(O1)C1Cc5ccc(O)cc5C4(CCN1CC1CC1)C23)C(=O)c1ccccc1