Reaction Details
TargetMu-type opioid receptor
LigandBDBM50253158
Substrate/Competitorn/a
Meas. Tech.ChEMBL_1685443 (CHEMBL4035922)
Ki 1.6±n/a nM
Citation Hayashida, KHirayama, SIwai, TWatanabe, YTakahashi, TSakai, JNakata, EYamakawa, TFujii, HNagase, H Novel delta opioid receptor agonists with oxazatricyclodecane structure showing potent agonistic activities. Bioorg Med Chem Lett27:2742-2745 (2017) 
 
Mu-type opioid receptor
Name:Mu-type opioid receptor
Type:G Protein-Coupled Receptor (GPCR)
Mol. Mass.:44789.51
Organism:Homo sapiens (Human)
Description:P35372
Residue:400
BDBM50253158
NameBDBM50253158
Synonyms:CHEMBL4100943
TypeSmall organic molecule
Emp. Form.C29H34N2O2
Mol. Mass.442.5925
SMILES[H][C@]12CN(Cc3ccccc3)C3CCC4(O1)C1Cc5ccc(O)cc5C4(CCN1CC1CC1)C23