Reaction Details
TargetDelta-type opioid receptor
LigandBDBM50253135
Substrate/Competitorn/a
Meas. Tech.ChEBML_1685441
Ki 0.760000±n/a nM
Citation Hayashida, KHirayama, SIwai, TWatanabe, YTakahashi, TSakai, JNakata, EYamakawa, TFujii, HNagase, H Novel delta opioid receptor agonists with oxazatricyclodecane structure showing potent agonistic activities. Bioorg Med Chem Lett27:2742-2745 (2017) 
 
Delta-type opioid receptor
Name:Delta-type opioid receptor
Type:Enzyme Catalytic Domain
Mol. Mass.:40577.25
Organism:MOUSE
Description:P32300
Residue:372
BDBM50253135
NameBDBM50253135
Synonyms:CHEMBL4060073
TypeSmall organic molecule
Emp. Form.C29H34N2O3
Mol. Mass.458.5919
SMILES[H][C@]12CN(C3CCC4(O1)C1Cc5ccc(O)cc5C4(CCN1CC(C)C)C23)C(=O)c1ccccc1