Reaction Details
TargetD(1A) dopamine receptor
LigandBDBM50007135
Substrate/Competitorn/a
Meas. Tech.ChEBML_60521
Ki 1030±n/a nM
Citation DeNinno, MPSchoenleber, RPerner, RJLijewski, LAsin, KEBritton, DRMacKenzie, RKebabian, JW Synthesis and dopaminergic activity of 3-substituted 1-(aminomethyl)-3,4-dihydro-5,6-dihydroxy-1H-2-benzopyrans: characterization of an auxiliary binding region in the D1 receptor. J Med Chem34:2561-9 (1991) D(1A) dopamine receptor
Name:D(1A) dopamine receptor
Type:Enzyme Catalytic Domain
Mol. Mass.:49429.75
Organism:RAT
Description:P18901
Residue:446
BDBM50007135
NameBDBM50007135
Synonyms:1-Aminomethyl-isochroman-5,6-diol | CHEMBL87958
TypeSmall organic molecule
Emp. Form.C10H13NO3
Mol. Mass.195.2151
SMILESNC[C@@H]1OCCc2c(O)c(O)ccc12