Reaction Details
TargetD(1A) dopamine receptor
LigandBDBM50007123
Substrate/Competitorn/a
Meas. Tech.ChEBML_60521
Ki 52±n/a nM
Citation DeNinno, MPSchoenleber, RPerner, RJLijewski, LAsin, KEBritton, DRMacKenzie, RKebabian, JW Synthesis and dopaminergic activity of 3-substituted 1-(aminomethyl)-3,4-dihydro-5,6-dihydroxy-1H-2-benzopyrans: characterization of an auxiliary binding region in the D1 receptor. J Med Chem34:2561-9 (1991) D(1A) dopamine receptor
Name:D(1A) dopamine receptor
Type:Enzyme Catalytic Domain
Mol. Mass.:49429.75
Organism:RAT
Description:P18901
Residue:446
BDBM50007123
NameBDBM50007123
Synonyms:1-Aminomethyl-3-(4-bromo-phenyl)-isochroman-5,6-diol | CHEMBL415080
TypeSmall organic molecule
Emp. Form.C16H16BrNO3
Mol. Mass.350.207
SMILESNC[C@@H]1OC(Cc2c(O)c(O)ccc12)c1ccc(Br)cc1