Reaction Details
TargetD(1A) dopamine receptor
LigandBDBM50007130
Substrate/Competitorn/a
Meas. Tech.ChEMBL_58641 (CHEMBL666355)
Ki 374±n/a nM
Citation DeNinno, MPSchoenleber, RPerner, RJLijewski, LAsin, KEBritton, DRMacKenzie, RKebabian, JW Synthesis and dopaminergic activity of 3-substituted 1-(aminomethyl)-3,4-dihydro-5,6-dihydroxy-1H-2-benzopyrans: characterization of an auxiliary binding region in the D1 receptor. J Med Chem34:2561-9 (1991) D(1A) dopamine receptor
Name:D(1A) dopamine receptor
Type:Enzyme Catalytic Domain
Mol. Mass.:49429.75
Organism:RAT
Description:P18901
Residue:446
BDBM50007130
NameBDBM50007130
Synonyms:1-Aminomethyl-3-phenoxymethyl-isochroman-5,6-diol | CHEMBL86576
TypeSmall organic molecule
Emp. Form.C17H19NO4
Mol. Mass.301.3371
SMILESNC[C@@H]1OC(COc2ccccc2)Cc2c(O)c(O)ccc12