Reaction Details
TargetD(2) dopamine receptor
LigandBDBM50007128
Substrate/Competitorn/a
Meas. Tech.ChEMBL_62257 (CHEMBL675484)
Ki 670±n/a nM
Citation DeNinno, MPSchoenleber, RPerner, RJLijewski, LAsin, KEBritton, DRMacKenzie, RKebabian, JW Synthesis and dopaminergic activity of 3-substituted 1-(aminomethyl)-3,4-dihydro-5,6-dihydroxy-1H-2-benzopyrans: characterization of an auxiliary binding region in the D1 receptor. J Med Chem34:2561-9 (1991) D(2) dopamine receptor
Name:D(2) dopamine receptor
Type:G Protein-Coupled Receptor (GPCR)
Mol. Mass.:50931.60
Organism:Rattus norvegicus (rat)
Description:P61169
Residue:444
BDBM50007128
NameBDBM50007128
Synonyms:1-Aminomethyl-3-phenethyl-isochroman-5,6-diol | CHEMBL84983
TypeSmall organic molecule
Emp. Form.C18H21NO3
Mol. Mass.299.3642
SMILESNC[C@@H]1OC(CCc2ccccc2)Cc2c(O)c(O)ccc12