Reaction Details
TargetD(2) dopamine receptor
LigandBDBM50007139
Substrate/Competitorn/a
Meas. Tech.ChEMBL_62257 (CHEMBL675484)
Ki 764±n/a nM
Citation DeNinno, MPSchoenleber, RPerner, RJLijewski, LAsin, KEBritton, DRMacKenzie, RKebabian, JW Synthesis and dopaminergic activity of 3-substituted 1-(aminomethyl)-3,4-dihydro-5,6-dihydroxy-1H-2-benzopyrans: characterization of an auxiliary binding region in the D1 receptor. J Med Chem34:2561-9 (1991) D(2) dopamine receptor
Name:D(2) dopamine receptor
Type:G Protein-Coupled Receptor (GPCR)
Mol. Mass.:50931.60
Organism:Rattus norvegicus (rat)
Description:P61169
Residue:444
BDBM50007139
NameBDBM50007139
Synonyms:1-Aminomethyl-3-(3-methoxy-phenyl)-isochroman-5,6-diol | CHEMBL315005
TypeSmall organic molecule
Emp. Form.C17H19NO4
Mol. Mass.301.3371
SMILESCOc1cccc(c1)C1Cc2c(O)c(O)ccc2[C@H](CN)O1