Reaction Details
TargetCarbonic anhydrase 1
LigandBDBM50253215
Substrate/Competitorn/a
Meas. Tech.ChEBML_1685486
Ki 86±n/a nM
Citation Angeli, ACarta, FBartolucci, GSupuran, CT Synthesis of novel acyl selenoureido benzensulfonamides as carbonic anhydrase I, II, VII and IX inhibitors. Bioorg Med Chem25:3567-3573 (2017) 
 
Carbonic anhydrase 1
Name:Carbonic anhydrase 1
Type:Enzyme
Mol. Mass.:28873.37
Organism:Homo sapiens (Human)
Description:P00915
Residue:261
BDBM50253215
NameBDBM50253215
Synonyms:CHEMBL4093916
TypeSmall organic molecule
Emp. Form.C15H11BrF3N3O4SSe
Mol. Mass.545.19
SMILESNS(=O)(=O)c1ccc(NC(=[Se])NC(=O)c2cc(Br)cc(OC(F)(F)F)c2)cc1