Reaction Details
TargetCarbonic anhydrase 9
LigandBDBM50334354
Substrate/Competitorn/a
Meas. Tech.ChEBML_1685489
Ki 45±n/a nM
Citation Angeli, ACarta, FBartolucci, GSupuran, CT Synthesis of novel acyl selenoureido benzensulfonamides as carbonic anhydrase I, II, VII and IX inhibitors. Bioorg Med Chem25:3567-3573 (2017) 
 
Carbonic anhydrase 9
Name:Carbonic anhydrase 9
Type:Enzyme
Mol. Mass.:49669.03
Organism:Homo sapiens (Human)
Description:Catalytic domain of human cloned isozyme was used in the assay
Residue:459
BDBM50334354
NameBDBM50334354
Synonyms:4-(3-(4-fluorophenyl)ureido)benzenesulfonamide 4-{[(4-fluorophenyl)carbamoyl]amino}benzenesulfonamide | CHEMBL1615281
TypeSmall organic molecule
Emp. Form.C13H12FN3O3S
Mol. Mass.309.316
SMILESNS(=O)(=O)c1ccc(NC(=O)Nc2ccc(F)cc2)cc1