Reaction Details
TargetCarbonic anhydrase 7
LigandBDBM50253233
Substrate/Competitorn/a
Meas. Tech.ChEBML_1685488
Ki 15±n/a nM
Citation Angeli, ACarta, FBartolucci, GSupuran, CT Synthesis of novel acyl selenoureido benzensulfonamides as carbonic anhydrase I, II, VII and IX inhibitors. Bioorg Med Chem25:3567-3573 (2017) 
 
Carbonic anhydrase 7
Name:Carbonic anhydrase 7
Type:Enzyme
Mol. Mass.:29664.11
Organism:Homo sapiens (Human)
Description:Human cloned isozyme.
Residue:264
BDBM50253233
NameBDBM50253233
Synonyms:CHEMBL4063591
TypeSmall organic molecule
Emp. Form.C15H15N3O3SSe
Mol. Mass.396.32
SMILESCc1cccc(c1)C(=O)NC(=[Se])Nc1cccc(c1)S(N)(=O)=O