Reaction Details
TargetCarbonic anhydrase 2
LigandBDBM50253232
Substrate/Competitorn/a
Meas. Tech.ChEBML_1685487
Ki 67±n/a nM
Citation Angeli, ACarta, FBartolucci, GSupuran, CT Synthesis of novel acyl selenoureido benzensulfonamides as carbonic anhydrase I, II, VII and IX inhibitors. Bioorg Med Chem25:3567-3573 (2017) 
 
Carbonic anhydrase 2
Name:Carbonic anhydrase 2
Type:Enzyme
Mol. Mass.:29250.71
Organism:Homo sapiens (Human)
Description:P00918
Residue:260
BDBM50253232
NameBDBM50253232
Synonyms:CHEMBL4072192
TypeSmall organic molecule
Emp. Form.C14H13N3O3SSe
Mol. Mass.382.3
SMILESNS(=O)(=O)c1ccccc1NC(=[Se])NC(=O)c1ccccc1