Reaction Details
TargetCarbonic anhydrase 2
LigandBDBM50253214
Substrate/Competitorn/a
Meas. Tech.ChEBML_1685487
Ki 9.1±n/a nM
Citation Angeli, ACarta, FBartolucci, GSupuran, CT Synthesis of novel acyl selenoureido benzensulfonamides as carbonic anhydrase I, II, VII and IX inhibitors. Bioorg Med Chem25:3567-3573 (2017) 
 
Carbonic anhydrase 2
Name:Carbonic anhydrase 2
Type:Enzyme
Mol. Mass.:29250.71
Organism:Homo sapiens (Human)
Description:P00918
Residue:260
BDBM50253214
NameBDBM50253214
Synonyms:CHEMBL4066350
TypeSmall organic molecule
Emp. Form.C16H15N3O5SSe
Mol. Mass.440.33
SMILESCC(=O)Oc1ccccc1C(=O)NC(=[Se])Nc1ccc(cc1)S(N)(=O)=O