Reaction Details
TargetCarbonic anhydrase 7
LigandBDBM50253242
Substrate/Competitorn/a
Meas. Tech.ChEBML_1685488
Ki 9.3±n/a nM
Citation Angeli, ACarta, FBartolucci, GSupuran, CT Synthesis of novel acyl selenoureido benzensulfonamides as carbonic anhydrase I, II, VII and IX inhibitors. Bioorg Med Chem25:3567-3573 (2017) 
 
Carbonic anhydrase 7
Name:Carbonic anhydrase 7
Type:Enzyme
Mol. Mass.:29664.11
Organism:Homo sapiens (Human)
Description:Human cloned isozyme.
Residue:264
BDBM50253242
NameBDBM50253242
Synonyms:CHEMBL4080767
TypeSmall organic molecule
Emp. Form.C14H13N3O3SSe
Mol. Mass.382.3
SMILESNS(=O)(=O)c1ccc(NC(=[Se])NC(=O)c2ccccc2)cc1