Reaction Details
TargetXanthine dehydrogenase/oxidase
LigandBDBM50320491
Substrate/Competitorn/a
Meas. Tech.ChEBML_1685824
IC50 10.0±n/a nM
Citation Muzychka, OVKobzar, OLPopova, AVFrasinyuk, MSVovk, AI Carboxylated aurone derivatives as potent inhibitors of xanthine oxidase. Bioorg Med Chem25:3606-3613 (2017) 
 
Xanthine dehydrogenase/oxidase
Name:Xanthine dehydrogenase/oxidase
Type:Protein
Mol. Mass.:146809.00
Organism:Bos taurus (Bovine)
Description:P80457
Residue:1332
BDBM50320491
NameBDBM50320491
Synonyms:2-(3-CYANO-4-ISOBUTOXY-PHENYL)-4-METHYL-5-THIAZOLE-CARBOXYLIC ACID FEBUXOSTAT | US11744839, Compound of formula 5
TypeSmall organic molecule
Emp. Form.C16H16N2O3S
Mol. Mass.316.375
SMILESCC(C)COc1ccc(cc1C#N)-c1nc(C)c(s1)C(O)=O