Reaction Details
TargetCarbonic anhydrase 1
LigandBDBM50253848
Substrate/Competitorn/a
Meas. Tech.ChEBML_1685885
Ki 650±n/a nM
Citation Karal?, NAkdemir, AGökta?, FEraslan Elma, PAngeli, AK?z?l?rmak, MSupuran, CT Novel sulfonamide-containing 2-indolinones that selectively inhibit tumor-associated alpha carbonic anhydrases. Bioorg Med Chem25:3714-3718 (2017) 
 
Carbonic anhydrase 1
Name:Carbonic anhydrase 1
Type:Enzyme
Mol. Mass.:28873.37
Organism:Homo sapiens (Human)
Description:P00915
Residue:261
BDBM50253848
NameBDBM50253848
Synonyms:CHEMBL4061260
TypeSmall organic molecule
Emp. Form.C15H12ClN5O3S2
Mol. Mass.409.87
SMILESNS(=O)(=O)c1ccc(NC(=S)N\N=C2/C(=O)Nc3ccc(Cl)cc23)cc1