Reaction Details
TargetCarbonic anhydrase-related protein 11
LigandBDBM50253874
Substrate/Competitorn/a
Meas. Tech.ChEBML_1685888
Ki 82±n/a nM
Citation Karal?, NAkdemir, AGökta?, FEraslan Elma, PAngeli, AK?z?l?rmak, MSupuran, CT Novel sulfonamide-containing 2-indolinones that selectively inhibit tumor-associated alpha carbonic anhydrases. Bioorg Med Chem25:3714-3718 (2017) 
 
Carbonic anhydrase-related protein 11
Name:Carbonic anhydrase-related protein 11
Type:PROTEIN
Mol. Mass.:36252.43
Organism:Homo sapiens
Description:ChEMBL_12954
Residue:328
BDBM50253874
NameBDBM50253874
Synonyms:CHEMBL4093328
TypeSmall organic molecule
Emp. Form.C15H11Cl2N5O3S2
Mol. Mass.444.316
SMILESNS(=O)(=O)c1ccc(NC(=S)N\N=C2/C(=O)Nc3c2cc(Cl)cc3Cl)cc1