Reaction Details
TargetCarbonic anhydrase 9
LigandBDBM50253851
Substrate/Competitorn/a
Meas. Tech.ChEBML_1685887
Ki 17±n/a nM
Citation Karal?, NAkdemir, AGökta?, FEraslan Elma, PAngeli, AK?z?l?rmak, MSupuran, CT Novel sulfonamide-containing 2-indolinones that selectively inhibit tumor-associated alpha carbonic anhydrases. Bioorg Med Chem25:3714-3718 (2017) 
 
Carbonic anhydrase 9
Name:Carbonic anhydrase 9
Type:Enzyme
Mol. Mass.:49669.03
Organism:Homo sapiens (Human)
Description:Catalytic domain of human cloned isozyme was used in the assay
Residue:459
BDBM50253851
NameBDBM50253851
Synonyms:CHEMBL4069928
TypeSmall organic molecule
Emp. Form.C15H12IN5O3S2
Mol. Mass.501.322
SMILESNS(=O)(=O)c1ccc(NC(=S)N\N=C2/C(=O)Nc3ccc(I)cc23)cc1