Reaction Details
TargetKappa-type opioid receptor
LigandBDBM50254123
Substrate/Competitorn/a
Meas. Tech.ChEBML_1686075
Ki 0.564000±n/a nM
Citation Watanabe, YHayashida, KSaito, DTakahashi, TSakai, JNakata, EKanda, TIwai, THirayama, SFujii, HYamakawa, TNagase, H Design and synthesis of novel? opioid receptor agonists with an azatricyclodecane skeleton for improving blood-brain barrier penetration. Bioorg Med Chem Lett27:3495-3498 (2017) 
 
Kappa-type opioid receptor
Name:Kappa-type opioid receptor
Type:G Protein-Coupled Receptor (GPCR)
Mol. Mass.:42648.76
Organism:Homo sapiens (Human)
Description:P41145
Residue:380
BDBM50254123
NameBDBM50254123
Synonyms:CHEMBL4068691
TypeSmall organic molecule
Emp. Form.C29H33N3O2
Mol. Mass.455.5912
SMILES[H][C@]12CN(C3CCC4(C1)C1Cc5ccc(O)cc5C4(CCN1CC1CC1)C23)C(=O)c1ccccn1