Reaction Details
TargetSerotonin 2 (5-HT2) receptor
LigandBDBM50007550
Substrate/Competitorn/a
Meas. Tech.ChEMBL_2226 (CHEMBL617171)
Ki 1±n/a nM
Citation Froimowitz, MRämsby, S Conformational properties of semirigid antipsychotic drugs: the pharmacophore for dopamine D-2 antagonist activity. J Med Chem34:1707-14 (1991) Serotonin 2 (5-HT2) receptor
Name:Serotonin 2 (5-HT2) receptor
Synonyms:5-hydroxytryptamine receptor 2A/2B/2C
Type:n/a
Mol. Mass.:n/a
Description:ASSAY_ID of ChEMBL is 2197423
Components:This complex has 3 components.
Component 1
Name:5-hydroxytryptamine receptor 2B
Type:G Protein-Coupled Receptor (GPCR)
Mol. Mass.:54312.47
Organism:Homo sapiens (Human)
Description:Receptor binding assays were performed using human clone stably expressed in CHO cells.
Residue:481
Component 2
Name:5-hydroxytryptamine receptor 2A
Synonyms:5-HT-2 5-HT2A 5-hydroxytryptamine receptor 2A (5HT-2A) 5HT2A_HUMAN HTR2A | Serotonin receptor 2A
Type:undefined
Mol. Mass.:52607.65
Organism:Homo sapiens (Human)
Description:P28223
Residue:471
Component 3
Name:5-hydroxytryptamine receptor 2C
Synonyms:5-HT-1C 5-HT1C 5-HT2C-INI 5-HTR2C 5-hydroxytryptamine receptor 2C (5-HT-2C) 5HT-1C HTR1C Serotonin (5-HT3) receptor Serotonin Receptor 2C
Type:G Protein-Coupled Receptor (GPCR)
Mol. Mass.:51836.79
Organism:Homo sapiens (Human)
Description:P28335
Residue:458
BDBM50007550
NameBDBM50007550
Synonyms:3'-chlorospiro[2-cyclohexene-1,5'-(10',11'-dihydro-5'H-dibenzo[a,d]cycloheptene)]-4-yl(dimethyl)amine Enantiomer 2'3'-chlorospiro[2-cyclohexene-1,5'-(10',11'-dihydro-5'H-dibenzo[a,d]cycloheptene)]-4-yl(dimethyl)amine
TypeSmall organic molecule
Emp. Form.C22H22ClN
Mol. Mass.335.87
SMILESCN(C)C1CCC2(C=C1)c1ccccc1C=Cc1ccc(Cl)cc21