Reaction Details
TargetD(1A) dopamine receptor
LigandBDBM50007551
Substrate/Competitorn/a
Meas. Tech.ChEBML_58968
Ki 0.330000±n/a nM
Citation Froimowitz, MRämsby, S Conformational properties of semirigid antipsychotic drugs: the pharmacophore for dopamine D-2 antagonist activity. J Med Chem34:1707-14 (1991) D(1A) dopamine receptor
Name:D(1A) dopamine receptor
Type:Enzyme
Mol. Mass.:49303.43
Organism:Homo sapiens (Human)
Description:P21728
Residue:446
BDBM50007551
NameBDBM50007551
Synonyms:3'-chlorospiro[2-cyclohexene-1,5'-(10',11'-dihydro-5'H-dibenzo[a,d]cycloheptene)]-4-yl(dimethyl)amine Enantiomer 1'3'-chlorospiro[2-cyclohexene-1,5'-(10',11'-dihydro-5'H-dibenzo[a,d]cycloheptene)]-4-yl(dimethyl)amine
TypeSmall organic molecule
Emp. Form.C22H24ClN
Mol. Mass.337.886
SMILESCN(C)C1CCC2(C=C1)c1ccccc1CCc1ccc(Cl)cc21