Reaction Details
TargetHistone deacetylase 8
LigandBDBM50397360
Substrate/Competitorn/a
Meas. Tech.ChEBML_1686558
IC50 10.0±n/a nM
Citation Bourguet, EOzdarska, KMoroy, GJeanblanc, JNaassila, M Class I HDAC Inhibitors: Potential New Epigenetic Therapeutics for Alcohol Use Disorder (AUD). J Med Chem61:1745-1766 (2018) 
 
Histone deacetylase 8
Name:Histone deacetylase 8
Type:Enzyme
Mol. Mass.:41749.60
Organism:Homo sapiens (Human)
Description:Q9BY41
Residue:377
BDBM50397360
NameBDBM50397360
Synonyms:CHEMBL2170177 | US10188756, Compound CN110
TypeSmall organic molecule
Emp. Form.C17H16N2O3
Mol. Mass.296.3205
SMILESCOc1ccc(Cn2ccc3ccc(cc23)C(=O)NO)cc1